{"text_format":"1","workbook":"xlsx","n_sheets":9,"sheets":["Sheet1","Sheet2","Sheet3","Sheet4","Sheet5","Cryogenics","Pivot Table with Hours","Pivot Table Raw Data","Pivot Table"],"not_rendered":{"charts":1,"images":0,"macros":1,"external_links":0,"defined_names":3,"comments":0,"pivot_tables":2},"unopened":[],"bounds":{"document_bytes":16777216,"sheet_cells":100000,"rows_first":2000,"rows_last":500,"rows_between":2000,"halvings":0,"cell_chars":16384,"cell_head_chars":4096},"cells_cut":0,"cells_raw":0,"read":"whole","date_system":"1900"}

{"sheet":"Sheet1","index":0,"n_rows":4,"n_cols":13,"rows_kept":4,"cut":false,"hidden":true,"merged":[]}
["Timesheet Date","PLC","Last First Name","Charged Hours","FTEs","Org Abbrev","WBS","CAM","Work Days","FTE Level","Actual FTE","Org","Division"]
["2007-10-15","SS","MERZ, WILLIAM A",0.5,0.01,"EESMGT","1.2.1.2.2.4","Merz",11,10.33,0.01,"1.CO.002.0003.01","Engineering Division"]
["2007-10-15","SS","MERZ, WILLIAM A",0.5,0.01,"EESMGT","1.2.1.2.2.3","Merz",11,10.33,0.01,"1.CO.002.0003.01","Engineering Division"]
["2007-10-15","SS","MERZ, WILLIAM A",3.5,0.05,"EESMGT","1.2.1.2.2.1","Merz",11,10.33,0.04,"1.CO.002.0003.01","Engineering Division"]

{"sheet":"Sheet2","index":1,"n_rows":2,"n_cols":13,"rows_kept":2,"cut":false,"hidden":true,"merged":[]}
["Timesheet Date","PLC","Last First Name","Charged Hours","FTEs","Org Abbrev","WBS","CAM","Work Days","FTE Level","Actual FTE","Org","Division"]
["Jan-08 Plan","SS","MERZ, WILLIAM A",0,null,"EESMGT","1.2.1.2.2.3","Merz",0,0,0.4,"1.CO.002.0003.01","Engineering Division"]

{"sheet":"Sheet3","index":2,"n_rows":2,"n_cols":13,"rows_kept":2,"cut":false,"hidden":true,"merged":[]}
["Timesheet Date","PLC","Last First Name","Charged Hours","FTEs","Org Abbrev","WBS","CAM","Work Days","FTE Level","Actual FTE","Org","Division"]
["Jan-08 Plan","SS","MERZ, WILLIAM A",0,null,"EESMGT","1.2.1.2.2.3","Merz",0,0,0.4,"1.CO.002.0003.01","Engineering Division"]

{"sheet":"Sheet4","index":3,"n_rows":2,"n_cols":13,"rows_kept":2,"cut":false,"hidden":true,"merged":[]}
["Timesheet Date","PLC","Last First Name","Charged Hours","FTEs","Org Abbrev","WBS","CAM","Work Days","FTE Level","Actual FTE","Org","Division"]
["2007-11-15","ME","MILLER, ROBERT P",86,1.17,"PHALLB","1.2.2.2.2","Latifa",11,10.33,1.1000000000000001,"1.CS.003.0002.03","Physics Division"]

{"sheet":"Sheet5","index":4,"n_rows":2,"n_cols":13,"rows_kept":2,"cut":false,"hidden":true,"merged":[]}
["Timesheet Date","PLC","Last First Name","Charged Hours","FTEs","Org Abbrev","WBS","CAM","Work Days","FTE Level","Actual FTE","Org","Division"]
["Jan-08 Plan","SS","MERZ, WILLIAM A",0,null,"EESMGT","1.2.4.3","Yasky",0,0,0,"1.CO.002.0003.01","Engineering Division"]

{"sheet":"Cryogenics","index":5,"n_rows":44,"n_cols":14,"rows_kept":44,"cut":false,"hidden":false,"merged":[[38,0,39,0],[42,0,43,0]]}
[]
[]
[]
[]
[]
[]
[]
[]
[]
[]
[]
[]
[]
[]
[]
[]
[]
[]
[]
[]
[]
[]
[]
[]
[]
[]
[]
[]
[]
[]
[]
[]
[]
[]
[]
[]
["Cryogenics"]
["ESR","By month","2018-10-01","2018-11-01","2018-12-01","2019-01-01","2019-02-01","2019-03-01","2019-04-01","2019-05-01","2019-06-01","2019-07-01","2019-08-01","2019-09-01"]
["Period Data","Planned",0,556,556,556,556,556,556,556,556,556,556,560]
[null,"Actuals",{"$f":"SUMIFS('Pivot Table Raw Data'!$D:$D,'Pivot Table Raw Data'!$O:$O,C$38,'Pivot Table Raw Data'!$G:$G,'Pivot Table Raw Data'!$G$2,'Pivot Table Raw Data'!$K:$K,'Pivot Table Raw Data'!$K$2,'Pivot Table Raw Data'!$K:$K,'Pivot Table Raw Data'!$K$2)+SUMIFS('Pivot Table Raw Data'!$D:$D,'Pivot Table Raw Data'!$O:$O,C$38,'Pivot Table Raw Data'!$G:$G,'Pivot Table Raw Data'!$G$2,'Pivot Table Raw Data'!$K:$K,'Pivot Table Raw Data'!$K$5,'Pivot Table Raw Data'!$K:$K,'Pivot Table Raw Data'!$K$5)","v":0},{"$f":"SUMIFS('Pivot Table Raw Data'!$D:$D,'Pivot Table Raw Data'!$O:$O,D$38,'Pivot Table Raw Data'!$G:$G,'Pivot Table Raw Data'!$G$2,'Pivot Table Raw Data'!$K:$K,'Pivot Table Raw Data'!$K$2,'Pivot Table Raw Data'!$K:$K,'Pivot Table Raw Data'!$K$2)","v":0},{"$f":"SUMIFS('Pivot Table Raw Data'!$D:$D,'Pivot Table Raw Data'!$O:$O,E$38,'Pivot Table Raw Data'!$G:$G,'Pivot Table Raw Data'!$G$2,'Pivot Table Raw Data'!$K:$K,'Pivot Table Raw Data'!$K$2,'Pivot Table Raw Data'!$K:$K,'Pivot Table Raw Data'!$K$2)","v":0},{"$f":"SUMIFS('Pivot Table Raw Data'!$D:$D,'Pivot Table Raw Data'!$O:$O,F$38,'Pivot Table Raw Data'!$G:$G,'Pivot Table Raw Data'!$G$2,'Pivot Table Raw Data'!$K:$K,'Pivot Table Raw Data'!$K$2,'Pivot Table Raw Data'!$K:$K,'Pivot Table Raw Data'!$K$2)","v":0},1198.7,562.5,509.5,659.1,{"$f":"SUMIFS('Pivot Table Raw Data'!$D:$D,'Pivot Table Raw Data'!$O:$O,K$38,'Pivot Table Raw Data'!$G:$G,'Pivot Table Raw Data'!$G$2,'Pivot Table Raw Data'!$K:$K,'Pivot Table Raw Data'!$K$2,'Pivot Table Raw Data'!$K:$K,'Pivot Table Raw Data'!$K$2)","v":0},{"$f":"SUMIFS('Pivot Table Raw Data'!$D:$D,'Pivot Table Raw Data'!$O:$O,L$38,'Pivot Table Raw Data'!$G:$G,'Pivot Table Raw Data'!$G$2,'Pivot Table Raw Data'!$K:$K,'Pivot Table Raw Data'!$K$2,'Pivot Table Raw Data'!$K:$K,'Pivot Table Raw Data'!$K$2)","v":0},{"$f":"SUMIFS('Pivot Table Raw Data'!$D:$D,'Pivot Table Raw Data'!$O:$O,M$38,'Pivot Table Raw Data'!$G:$G,'Pivot Table Raw Data'!$G$2,'Pivot Table Raw Data'!$K:$K,'Pivot Table Raw Data'!$K$2,'Pivot Table Raw Data'!$K:$K,'Pivot Table Raw Data'!$K$2)","v":0},{"$f":"SUMIFS('Pivot Table Raw Data'!$D:$D,'Pivot Table Raw Data'!$O:$O,N$38,'Pivot Table Raw Data'!$G:$G,'Pivot Table Raw Data'!$G$2,'Pivot Table Raw Data'!$K:$K,'Pivot Table Raw Data'!$K$2,'Pivot Table Raw Data'!$K:$K,'Pivot Table Raw Data'!$K$2)","v":0}]
[]
[null,"Cum","2018-10-01","2018-11-01","2018-12-01","2019-01-01","2019-02-01","2019-03-01","2019-04-01","2019-05-01","2019-06-01","2019-07-01","2019-08-01","2019-09-01"]
["Cum Data","Planned",{"$f":"C39","v":0},{"$f":"C43+D39","v":556},{"$f":"D43+E39","v":1112},1668,2224,2780,3336,3892,4448,5004,5560,6120]
[null,"Actuals",{"$f":"C40","v":0},{"$f":"C44+D40","v":0},0,0,{"$f":"F44+G40","v":1198.7},{"$f":"G44+H40","v":1761.2},2270.6999999999998,2929.7999999999997]

{"sheet":"Pivot Table with Hours","index":6,"n_rows":22,"n_cols":10,"rows_kept":22,"cut":false,"hidden":false,"merged":[]}
["Sum of Charged Hours","Column Labels"]
["Pay Periods","2019-02-15","2019-02-28","2019-03-15","2019-03-31","2019-04-15","2019-04-30","2019-05-15","2019-05-31","Sum"]
["000001.12.3.2.6",782.5,416.2,323,239.5,256.3,253.2,374.1,285,2929.8]
["Engineering",720,396.2,312,235.5,253.3,248.7,348.1,272.5,2786.3]
["ARENIUS, DANA M",118,93,44,28,40,44,36,36,439]
["BUTLER, COREY R",87,23.7,58,14,25.8,24.2,58.6,59.5,350.8]
["CREEL, JONATHAN D",7,12,null,null,null,null,null,null,19]
["DIXON, KELLY D",89,17,null,12,6,5.5,6,7,142.5]
["GRAVES, TROY",null,null,null,null,null,null,61.5,null,61.5]
["MASTRACCI, BRIAN P",null,14,null,null,null,null,null,null,14]
["MATALEVICH, JOSEPH R",null,85,63,27,45,81,67.5,68,436.5]
["PERRY, CHRISTOPHER C",269,51,75,57.5,39.5,9,39,13,553]
["RATH, DAMON F",150,62.5,58,77,88,80,79.5,88,683]
["WIJERATNE, THILAN K",null,38,14,20,9,5,null,1,87]
["Facilities",null,19,6,null,null,null,8,null,33]
["RENZO, THOMAS C",null,18,6,null,null,null,8,null,32]
["SOLAROLI, MICHELE L",null,1,null,null,null,null,null,null,1]
["CPO",62.5,1,5,4,3,4.5,18,12.5,110.5]
["DOUGHERTY, CECIL",null,null,null,null,null,1,null,null,1]
["DOUGHERTY, CECIL B",null,null,null,null,null,null,13,7.5,20.5]
["WILHELM, THOMAS",62.5,1,5,4,3,3.5,5,5,89]
["Sum",782.5,416.2,323,239.5,256.3,253.2,374.1,285,2929.8]

{"sheet":"Pivot Table Raw Data","index":7,"n_rows":103,"n_cols":15,"rows_kept":103,"cut":false,"hidden":false,"merged":[]}
["Timesheet Date","PLC","Last First Name","Charged Hours","FTEs","Org Abbrev","WBS","Work Days","FTE Level","Actual FTE","Division","General Labor Category","Reg/Term","Position Term Date"]
["2019-02-15","SS","ARENIUS, DANA M",34,0.46363636363636401,"MSCRYO","000001.12.3.2.6",11,10.33333,0.43553704958677703,"Engineering","3511R","R",null,"2019-02-01"]
["2019-02-15","SS","ARENIUS, DANA M",40,0.54545454545454497,"MSCRYO","000001.12.3.2.6",11,10.33333,0.51239652892562004,"Engineering","3511R","R",null,"2019-02-01"]
["2019-02-15","SS","ARENIUS, DANA M",44,0.6,"MSCRYO","000001.12.3.2.6",11,10.33333,0.56363618181818198,"Engineering","3511R","R",null,"2019-02-01"]
["2019-02-15","MT","BUTLER, COREY R",43,0.58636363636363598,"MSCRYO","000001.12.3.2.6",11,10.33333,0.55082626859504102,"Engineering","4142R","R",null,"2019-02-01"]
["2019-02-15","MT","BUTLER, COREY R",2,2.72727E-2,"MSCRYO","000001.12.3.2.6",11,10.33333,2.5619800000000002E-2,"Engineering","4142R","R",null,"2019-02-01"]
["2019-02-15","MT","BUTLER, COREY R",19.5,0.26590909090909098,"MSCRYO","000001.12.3.2.6",11,10.33333,0.24979330785123999,"Engineering","4142R","R",null,"2019-02-01"]
["2019-02-15","MT","BUTLER, COREY R",21.5,0.29318181818181799,"MSCRYO","000001.12.3.2.6",11,10.33333,0.27541313429752101,"Engineering","4142R","R",null,"2019-02-01"]
["2019-02-15","MT","BUTLER, COREY R",1,1.36364E-2,"MSCRYO","000001.12.3.2.6",11,10.33333,1.2809900000000001E-2,"Engineering","4142R","R",null,"2019-02-01"]
["2019-02-15","SS","CREEL, JONATHAN D",7,9.5454499999999998E-2,"MSCRYO","000001.12.3.2.6",11,10.33333,8.9669399999999996E-2,"Engineering","3411R","R",null,"2019-02-01"]
["2019-02-15","SS","DIXON, KELLY D",17,0.23181818181818201,"MSCRYO","000001.12.3.2.6",11,10.33333,0.21776852479338801,"Engineering","3427R","R",null,"2019-02-01"]
["2019-02-15","SS","DIXON, KELLY D",2,2.72727E-2,"MSCRYO","000001.12.3.2.6",11,10.33333,2.5619800000000002E-2,"Engineering","3427R","R",null,"2019-02-01"]
["2019-02-15","SS","DIXON, KELLY D",31,0.42272727272727301,"MSCRYO","000001.12.3.2.6",11,10.33333,0.39710730991735499,"Engineering","3427R","R",null,"2019-02-01"]
["2019-02-15","SS","DIXON, KELLY D",8,0.109090909090909,"MSCRYO","000001.12.3.2.6",11,10.33333,0.102479305785124,"Engineering","3427R","R",null,"2019-02-01"]
["2019-02-15","SS","DIXON, KELLY D",13,0.177272727272727,"MSCRYO","000001.12.3.2.6",11,10.33333,0.16652887190082599,"Engineering","3427R","R",null,"2019-02-01"]
["2019-02-15","SS","DIXON, KELLY D",6,8.1818199999999994E-2,"MSCRYO","000001.12.3.2.6",11,10.33333,7.6859499999999997E-2,"Engineering","3427R","R",null,"2019-02-01"]
["2019-02-15","SS","DIXON, KELLY D",12,0.163636363636364,"MSCRYO","000001.12.3.2.6",11,10.33333,0.15371895867768601,"Engineering","3427R","R",null,"2019-02-01"]
["2019-02-15","ME","PERRY, CHRISTOPHER C",71,0.96818181818181803,"MSCRYO","000001.12.3.2.6",11,10.33333,0.90950383884297503,"Engineering","3227R","R",null,"2019-02-01"]
["2019-02-15","ME","PERRY, CHRISTOPHER C",24,0.32727272727272699,"MSCRYO","000001.12.3.2.6",11,10.33333,0.30743791735537201,"Engineering","3227R","R",null,"2019-02-01"]
["2019-02-15","ME","PERRY, CHRISTOPHER C",60,0.81818181818181801,"MSCRYO","000001.12.3.2.6",11,10.33333,0.76859479338842995,"Engineering","3227R","R",null,"2019-02-01"]
["2019-02-15","ME","PERRY, CHRISTOPHER C",55,0.75,"MSCRYO","000001.12.3.2.6",11,10.33333,0.70454522727272695,"Engineering","3227R","R",null,"2019-02-01"]
["2019-02-15","ME","PERRY, CHRISTOPHER C",12,0.163636363636364,"MSCRYO","000001.12.3.2.6",11,10.33333,0.15371895867768601,"Engineering","3227R","R",null,"2019-02-01"]
["2019-02-15","ME","PERRY, CHRISTOPHER C",47,0.64090909090909098,"MSCRYO","000001.12.3.2.6",11,10.33333,0.60206592148760296,"Engineering","3227R","R",null,"2019-02-01"]
["2019-02-15","MD","RATH, DAMON F",85,1.1590909090909101,"MSMECH","000001.12.3.2.6",11,10.33333,1.08884262396694,"Engineering","7342R","R",null,"2019-02-01"]
["2019-02-15","MD","RATH, DAMON F",65,0.88636363636363602,"MSMECH","000001.12.3.2.6",11,10.33333,0.83264435950413196,"Engineering","7342R","R",null,"2019-02-01"]
["2019-02-15","ADM","WILHELM, THOMAS",8.5,0.115909090909091,"CPO","000001.12.3.2.6",11,10.33333,0.10888426239669401,"CPO","121PR","R",null,"2019-02-01"]
["2019-02-15","ADM","WILHELM, THOMAS",4.5,6.1363599999999997E-2,"CPO","000001.12.3.2.6",11,10.33333,5.7644599999999997E-2,"CPO","121PR","R",null,"2019-02-01"]
["2019-02-15","ADM","WILHELM, THOMAS",2.5,3.40909E-2,"CPO","000001.12.3.2.6",11,10.33333,3.2024799999999999E-2,"CPO","121PR","R",null,"2019-02-01"]
["2019-02-15","ADM","WILHELM, THOMAS",2,2.72727E-2,"CPO","000001.12.3.2.6",11,10.33333,2.5619800000000002E-2,"CPO","121PR","R",null,"2019-02-01"]
["2019-02-15","ADM","WILHELM, THOMAS",30,0.40909090909090901,"CPO","000001.12.3.2.6",11,10.33333,0.38429739669421498,"CPO","121PR","R",null,"2019-02-01"]
["2019-02-15","ADM","WILHELM, THOMAS",15,0.204545454545455,"CPO","000001.12.3.2.6",11,10.33333,0.19214869834710699,"CPO","121PR","R",null,"2019-02-01"]
["2019-02-28","SS","ARENIUS, DANA M",23,0.31363636363636399,"MSCRYO","000001.12.3.2.6",9,10.33333,0.36010089393939398,"Engineering","3511R","R",null,"2019-02-01"]
["2019-02-28","SS","ARENIUS, DANA M",36,0.49090909090909102,"MSCRYO","000001.12.3.2.6",9,10.33333,0.56363618181818198,"Engineering","3511R","R",null,"2019-02-01"]
["2019-02-28","SS","ARENIUS, DANA M",34,0.46363636363636401,"MSCRYO","000001.12.3.2.6",9,10.33333,0.53232306060606105,"Engineering","3511R","R",null,"2019-02-01"]
["2019-02-28","MT","BUTLER, COREY R",23.7,0.32318181818181801,"MSCRYO","000001.12.3.2.6",9,10.33333,0.37106048636363598,"Engineering","4142R","R",null,"2019-02-01"]
["2019-02-28","SS","CREEL, JONATHAN D",3,4.0909099999999997E-2,"MSCRYO","000001.12.3.2.6",9,10.33333,4.6969700000000003E-2,"Engineering","3411R","R",null,"2019-02-01"]
["2019-02-28","SS","CREEL, JONATHAN D",2,2.72727E-2,"MSCRYO","000001.12.3.2.6",9,10.33333,3.1313100000000003E-2,"Engineering","3411R","R",null,"2019-02-01"]
["2019-02-28","SS","CREEL, JONATHAN D",7,9.5454499999999998E-2,"MSCRYO","000001.12.3.2.6",9,10.33333,0.10959592424242399,"Engineering","3411R","R",null,"2019-02-01"]
["2019-02-28","SS","DIXON, KELLY D",17,0.23181818181818201,"MSCRYO","000001.12.3.2.6",9,10.33333,0.26616153030303003,"Engineering","3427R","R",null,"2019-02-01"]
["2019-02-28","ME","MASTRACCI, BRIAN P",12,0.163636363636364,"MSCRYO","000001.12.3.2.6",9,10.33333,0.187878727272727,"Engineering","3122R","R",null,"2019-02-01"]
["2019-02-28","ME","MASTRACCI, BRIAN P",2,2.72727E-2,"MSCRYO","000001.12.3.2.6",9,10.33333,3.1313100000000003E-2,"Engineering","3122R","R",null,"2019-02-01"]
["2019-02-28","ME","MATALEVICH, JOSEPH R",24,0.32727272727272699,"MSMECH","000001.12.3.2.6",9,10.33333,0.37575745454545501,"Engineering","3322R","R",null,"2019-02-01"]
["2019-02-28","ME","MATALEVICH, JOSEPH R",24,0.32727272727272699,"MSMECH","000001.12.3.2.6",9,10.33333,0.37575745454545501,"Engineering","3322R","R",null,"2019-02-01"]
["2019-02-28","ME","MATALEVICH, JOSEPH R",37,0.50454545454545496,"MSMECH","000001.12.3.2.6",9,10.33333,0.579292742424242,"Engineering","3322R","R",null,"2019-02-01"]
["2019-02-28","ME","PERRY, CHRISTOPHER C",51,0.69545454545454499,"MSCRYO","000001.12.3.2.6",9,10.33333,0.79848459090909096,"Engineering","3227R","R",null,"2019-02-01"]
["2019-02-28","MD","RATH, DAMON F",62.5,0.85227272727272696,"MSMECH","000001.12.3.2.6",9,10.33333,0.97853503787878804,"Engineering","7342R","R",null,"2019-02-01"]
["2019-02-28","PE","RENZO, THOMAS C",18,0.24545454545454501,"FMENG","000001.12.3.2.6",9,10.33333,0.28181809090909099,"Facilities","3200T","T","2020-05-30","2019-02-01"]
["2019-02-28","PE","SOLAROLI, MICHELE L",1,1.36364E-2,"FMENG","000001.12.3.2.6",9,10.33333,1.56566E-2,"Facilities","3300R","R",null,"2019-02-01"]
["2019-02-28","ME","WIJERATNE, THILAN K",13,0.177272727272727,"MSCRYO","000001.12.3.2.6",9,10.33333,0.203535287878788,"Engineering","3127R","R",null,"2019-02-01"]
["2019-02-28","ME","WIJERATNE, THILAN K",25,0.34090909090909099,"MSCRYO","000001.12.3.2.6",9,10.33333,0.39141401515151503,"Engineering","3127R","R",null,"2019-02-01"]
["2019-02-28","ADM","WILHELM, THOMAS",1,1.36364E-2,"CPO","000001.12.3.2.6",9,10.33333,1.56566E-2,"CPO","121PR","R",null,"2019-02-01"]
["2019-03-15","SS","ARENIUS, DANA M",44,0.6,"MSCRYO","000001.12.3.2.6",11,10.33333,0.56363618181818198,"Engineering","3511R","R",null,"2019-03-01"]
["2019-03-15","MT","BUTLER, COREY R",58,0.79090909090909101,"MSCRYO","000001.12.3.2.6",11,10.33333,0.74297496694214904,"Engineering","4142R","R",null,"2019-03-01"]
["2019-03-15","SS","MATALEVICH, JOSEPH R",63,0.85909090909090902,"MSMECH","000001.12.3.2.6",11,10.33333,0.80702453305785105,"Engineering","3422R","R",null,"2019-03-01"]
["2019-03-15","ME","PERRY, CHRISTOPHER C",75,1.02272727272727,"MSCRYO","000001.12.3.2.6",11,10.33333,0.96074349173553697,"Engineering","3227R","R",null,"2019-03-01"]
["2019-03-15","MD","RATH, DAMON F",58,0.79090909090909101,"MSMECH","000001.12.3.2.6",11,10.33333,0.74297496694214904,"Engineering","4132R","R",null,"2019-03-01"]
["2019-03-15","PE","RENZO, THOMAS C",6,8.1818199999999994E-2,"FMENG","000001.12.3.2.6",11,10.33333,7.6859499999999997E-2,"Facilities","3200T","T","2020-05-30","2019-03-01"]
["2019-03-15","ME","WIJERATNE, THILAN K",14,0.190909090909091,"MSCRYO","000001.12.3.2.6",11,10.33333,0.179338785123967,"Engineering","3127R","R",null,"2019-03-01"]
["2019-03-15","ADM","WILHELM, THOMAS",5,6.8181800000000001E-2,"CPO","000001.12.3.2.6",11,10.33333,6.4049599999999998E-2,"CPO","121PR","R",null,"2019-03-01"]
["2019-03-31","SS","ARENIUS, DANA M",28,0.381818181818182,"MSCRYO","000001.12.3.2.6",10,10.33333,0.39454532727272701,"Engineering","3511R","R",null,"2019-03-01"]
["2019-03-31","MT","BUTLER, COREY R",14,0.190909090909091,"MSCRYO","000001.12.3.2.6",10,10.33333,0.197272663636364,"Engineering","4142R","R",null,"2019-03-01"]
["2019-03-31","SS","DIXON, KELLY D",12,0.163636363636364,"MSCRYO","000001.12.3.2.6",10,10.33333,0.169090854545455,"Engineering","3427R","R",null,"2019-03-01"]
["2019-03-31","SS","MATALEVICH, JOSEPH R",27,0.368181818181818,"MSMECH","000001.12.3.2.6",10,10.33333,0.38045442272727298,"Engineering","3422R","R",null,"2019-03-01"]
["2019-03-31","ME","PERRY, CHRISTOPHER C",57.5,0.78409090909090895,"MSCRYO","000001.12.3.2.6",10,10.33333,0.81022701136363595,"Engineering","3227R","R",null,"2019-03-01"]
["2019-03-31","MD","RATH, DAMON F",77,1.05,"MSMECH","000001.12.3.2.6",10,10.33333,1.0849996500000001,"Engineering","4132R","R",null,"2019-03-01"]
["2019-03-31","ME","WIJERATNE, THILAN K",20,0.27272727272727298,"MSCRYO","000001.12.3.2.6",10,10.33333,0.28181809090909099,"Engineering","3127R","R",null,"2019-03-01"]
["2019-03-31","ADM","WILHELM, THOMAS",4,5.4545499999999997E-2,"CPO","000001.12.3.2.6",10,10.33333,5.63636E-2,"CPO","121PR","R",null,"2019-03-01"]
["2019-04-15","SS","ARENIUS, DANA M",40,0.54545454545454497,"MSCRYO","000001.12.3.2.6",11,10.33333,0.51239652892562004,"Engineering","3511R","R",null,"2019-04-01"]
["2019-04-15","MT","BUTLER, COREY R",25.8,0.35181818181818197,"MSCRYO","000001.12.3.2.6",11,10.33333,0.330495761157025,"Engineering","4142R","R",null,"2019-04-01"]
["2019-04-15","SS","DIXON, KELLY D",6,8.1818199999999994E-2,"MSCRYO","000001.12.3.2.6",11,10.33333,7.6859499999999997E-2,"Engineering","3427R","R",null,"2019-04-01"]
["2019-04-15","SS","MATALEVICH, JOSEPH R",45,0.61363636363636398,"MSMECH","000001.12.3.2.6",11,10.33333,0.57644609504132205,"Engineering","3422R","R",null,"2019-04-01"]
["2019-04-15","ME","PERRY, CHRISTOPHER C",39.5,0.53863636363636402,"MSCRYO","000001.12.3.2.6",11,10.33333,0.50599157231405001,"Engineering","3227R","R",null,"2019-04-01"]
["2019-04-15","MD","RATH, DAMON F",88,1.2,"MSMECH","000001.12.3.2.6",11,10.33333,1.12727236363636,"Engineering","4132R","R",null,"2019-04-01"]
["2019-04-15","ME","WIJERATNE, THILAN K",9,0.122727272727273,"MSCRYO","000001.12.3.2.6",11,10.33333,0.115289219008264,"Engineering","3127R","R",null,"2019-04-01"]
["2019-04-15","ADM","WILHELM, THOMAS",3,4.0909099999999997E-2,"CPO","000001.12.3.2.6",11,10.33333,3.8429699999999997E-2,"CPO","121PR","R",null,"2019-04-01"]
["2019-04-30","SS","ARENIUS, DANA M",44,0.54545454545454497,"MSCRYO","000001.12.3.2.6",11,10.33333,0.51239652892562004,"Engineering","3511R","R",null,"2019-04-01"]
["2019-04-30","MT","BUTLER, COREY R",24.2,0.35181818181818197,"MSCRYO","000001.12.3.2.6",11,10.33333,0.330495761157025,"Engineering","4142R","R",null,"2019-04-01"]
["2019-04-30","SS","DIXON, KELLY D",5.5,8.1818199999999994E-2,"MSCRYO","000001.12.3.2.6",11,10.33333,7.6859499999999997E-2,"Engineering","3427R","R",null,"2019-04-01"]
["2019-04-30","SS","MATALEVICH, JOSEPH R",81,0.61363636363636398,"MSMECH","000001.12.3.2.6",11,10.33333,0.57644609504132205,"Engineering","3422R","R",null,"2019-04-01"]
["2019-04-30","ME","PERRY, CHRISTOPHER C",9,0.53863636363636402,"MSCRYO","000001.12.3.2.6",11,10.33333,0.50599157231405001,"Engineering","3227R","R",null,"2019-04-01"]
["2019-04-30","MD","RATH, DAMON F",80,1.2,"MSMECH","000001.12.3.2.6",11,10.33333,1.12727236363636,"Engineering","4132R","R",null,"2019-04-01"]
["2019-04-30","ME","WIJERATNE, THILAN K",5,0.122727272727273,"MSCRYO","000001.12.3.2.6",11,10.33333,0.115289219008264,"Engineering","3127R","R",null,"2019-04-01"]
["2019-04-30","ADM","WILHELM, THOMAS",3.5,4.0909099999999997E-2,"CPO","000001.12.3.2.6",11,10.33333,3.8429699999999997E-2,"CPO","121PR","R",null,"2019-04-01"]
["2019-04-30","ADM","DOUGHERTY, CECIL",1,4.0909099999999997E-2,"CPO","000001.12.3.2.6",11,10.33333,3.8429699999999997E-2,"CPO","121PR","R",null,"2019-04-01"]
["2019-05-15","SS","ARENIUS, DANA M",36,0.49090909090909102,"MSCRYO","000001.12.3.2.6",11,10.33333,0.46115687603305799,"Engineering","3511R","R",null,"2019-05-01"]
["2019-05-15","MT","BUTLER, COREY R",58.6,0.79909090909090896,"MSCRYO","000001.12.3.2.6",11,10.33333,0.75066091487603304,"Engineering","4142R","R",null,"2019-05-01"]
["2019-05-15","SS","DIXON, KELLY D",6,8.1818199999999994E-2,"MSCRYO","000001.12.3.2.6",11,10.33333,7.6859499999999997E-2,"Engineering","3427R","R",null,"2019-05-01"]
["2019-05-15","ADM","DOUGHERTY, CECIL B",13,0.177272727272727,"CPO","000001.12.3.2.6",11,10.33333,0.16652887190082599,"CPO","121PR","R",null,"2019-05-01"]
["2019-05-15","MT","GRAVES, TROY",61.5,0.83863636363636396,"MSCRYO","000001.12.3.2.6",11,10.33333,0.78780966322314006,"Engineering","7237R","R",null,"2019-05-01"]
["2019-05-15","SS","MATALEVICH, JOSEPH R",67.5,0.92045454545454497,"MSMECH","000001.12.3.2.6",11,10.33333,0.86466914256198302,"Engineering","3422R","R",null,"2019-05-01"]
["2019-05-15","ME","PERRY, CHRISTOPHER C",39,0.53181818181818197,"MSCRYO","000001.12.3.2.6",11,10.33333,0.49958661570247898,"Engineering","3227R","R",null,"2019-05-01"]
["2019-05-15","MD","RATH, DAMON F",79.5,1.0840909090909101,"MSMECH","000001.12.3.2.6",11,10.33333,1.0183881012396701,"Engineering","4132R","R",null,"2019-05-01"]
["2019-05-15","PE","RENZO, THOMAS C",8,0.109090909090909,"FMENG","000001.12.3.2.6",11,10.33333,0.102479305785124,"Facilities","3200T","T","2020-05-30","2019-05-01"]
["2019-05-15","ADM","WILHELM, THOMAS",5,6.8181800000000001E-2,"CPO","000001.12.3.2.6",11,10.33333,6.4049599999999998E-2,"CPO","121PR","R",null,"2019-05-01"]
["2019-05-31","SS","ARENIUS, DANA M",36,0.49090909090909102,"MSCRYO","000001.12.3.2.6",11,10.33333,0.46115687603305799,"Engineering","3511R","R",null,"2019-05-01"]
["2019-05-31","MT","BUTLER, COREY R",59.5,0.81136363636363595,"MSCRYO","000001.12.3.2.6",11,10.33333,0.76218983677686003,"Engineering","4142R","R",null,"2019-05-01"]
["2019-05-31","SS","DIXON, KELLY D",7,9.5454499999999998E-2,"MSCRYO","000001.12.3.2.6",11,10.33333,8.9669399999999996E-2,"Engineering","3427R","R",null,"2019-05-01"]
["2019-05-31","ADM","DOUGHERTY, CECIL B",7.5,0.102272727272727,"CPO","000001.12.3.2.6",11,10.33333,9.6074300000000001E-2,"CPO","121PR","R",null,"2019-05-01"]
["2019-05-31","SS","MATALEVICH, JOSEPH R",68,0.92727272727272703,"MSMECH","000001.12.3.2.6",11,10.33333,0.87107409917355405,"Engineering","3422R","R",null,"2019-05-01"]
["2019-05-31","ME","PERRY, CHRISTOPHER C",13,0.177272727272727,"MSCRYO","000001.12.3.2.6",11,10.33333,0.16652887190082599,"Engineering","3227R","R",null,"2019-05-01"]
["2019-05-31","MD","RATH, DAMON F",88,1.2,"MSMECH","000001.12.3.2.6",11,10.33333,1.12727236363636,"Engineering","4132R","R",null,"2019-05-01"]
["2019-05-31","ME","WIJERATNE, THILAN K",1,1.36364E-2,"MSCRYO","000001.12.3.2.6",11,10.33333,1.2809900000000001E-2,"Engineering","3127R","R",null,"2019-05-01"]
["2019-05-31","ADM","WILHELM, THOMAS",5,6.8181800000000001E-2,"CPO","000001.12.3.2.6",11,10.33333,6.4049599999999998E-2,"CPO","121PR","R",null,"2019-05-01"]

{"sheet":"Pivot Table","index":8,"n_rows":5,"n_cols":34,"rows_kept":5,"cut":false,"hidden":false,"merged":[]}
[]
[]
["Pay Periods","Sum of Charged Hours"]
["Grand Total"]
[null,null,null,null,null,null,null,null,null,null,null,null,null,null,null,null,null,null,null,null,null,null,null,null,null,null,175.1,166.77,133.77000000000001,166.77,166.77,191.78,166.78,183.44]